Target
Transthyretin
Ligand
BDBM249480
Substrate
Meas. Tech.
Scintillation Proximity RBP4 Binding Assay
pH
7.4±n/a
Temperature
298.15±n/a K
IC50
15.8±n/a nM
Comments
extracted
Citation
 Petrukhin, KCioffi, CJohnson, GAllikmets, RFreeman, EChen, PConlon, MZhu, L Substituted 4-phenylpiperidines, their preparation and use US Patent  US10072016 Publication Date 9/11/2018 
Target
Name:
Transthyretin
Synonyms:
ATTR Prealbumin TTHY_HUMAN Transthyretin (TTR)
Type:
Enzyme
Mol. Mass.:
15884.31
Organism:
Homo sapiens (Human)
Description:
P02766
Residue:
147
  
Inhibitor
Name:
BDBM249480
Synonyms:
US10072016, Compound 78 US10913746, Compound 78 US9434727, 78 | US9777010, Compound 78
Type:
Small organic molecule
Emp. Form.:
C22H24F4N4O2
Mol. Mass.:
452.4452
SMILES:
Fc1cccc(C2CCN(CC2)C(=O)c2n[nH]c3CN(CCc23)C2COC2)c1C(F)(F)F
: