Target
Neuropeptide FF receptor 2
Ligand
BDBM86148
Substrate
Ki
23±n/a nM
Comments
PDSP_2994
Citation
 Engström, MBrandt, AWurster, SSavola, JMPanula, P Prolactin releasing peptide has high affinity and efficacy at neuropeptide FF2 receptors. J Pharmacol Exp Ther 305:825-32 (2003)  
Target
Name:
Neuropeptide FF receptor 2
Synonyms:
G-protein coupled receptor 74 GPR74 NPFF2_HUMAN NPGPR Neuropeptide G-protein coupled receptor
Type:
Enzyme Catalytic Domain
Mol. Mass.:
60293.78
Organism:
Homo sapiens (Human)
Description:
NPFF2 0 HUMAN::Q9Y5X5
Residue:
522
  
Inhibitor
Name:
BDBM86148
Synonyms:
CAS_222988-10-5 | PrRP20
Type:
Small organic molecule
Emp. Form.:
C104H158N32O26
Mol. Mass.:
2272.5661
SMILES:
CC[C@H](C)[C@H](NC(=O)CNC(=O)[C@H](CCCN=C(N)N)NC(=O)CNC(=O)[C@@H](NC(=O)[C@H](Cc1ccc(O)cc1)NC(=O)[C@H](Cc1c[nH]c2ccccc12)NC(=O)[C@H](C)NC(=O)[C@@H]1CCCN1C(=O)[C@H](CC(N)=O)NC(=O)[C@@H](NC(=O)[C@H](CC(O)=O)NC(=O)[C@@H]1CCCN1C(=O)[C@@H](N)[C@@H](C)O)[C@@H](C)CC)[C@@H](C)O)C(=O)N[C@@H](CCCN=C(N)N)C(=O)N1CCC[C@H]1C(=O)N[C@@H](C(C)C)C(=O)NCC(=O)N[C@@H](CCCN=C(N)N)C(=O)N[C@@H](Cc1ccccc1)C(N)=O
: