Target
Prolactin-releasing peptide receptor
Ligand
BDBM84996
Substrate
Ki
>10000±n/a nM
Comments
PDSP_2993
Citation
 Engström, MBrandt, AWurster, SSavola, JMPanula, P Prolactin releasing peptide has high affinity and efficacy at neuropeptide FF2 receptors. J Pharmacol Exp Ther 305:825-32 (2003)  
Target
Name:
Prolactin-releasing peptide receptor
Synonyms:
G-protein coupled receptor 10 (GPR10) GR3 PRLHR_HUMAN Prolactin-releasing peptide receptor
Type:
Protein
Mol. Mass.:
41138.32
Organism:
Homo sapiens (Human)
Description:
P49683
Residue:
370
  
Inhibitor
Name:
BDBM84996
Synonyms:
BIBP3226 NSC_5311023
Type:
Small organic molecule
Emp. Form.:
C27H31N5O3
Mol. Mass.:
473.5667
SMILES:
[#7]\[#6](-[#7])=[#7]\[#6]-[#6]-[#6]-[#6](-[#7]-[#6](=O)-[#6](-c1ccccc1)-c1ccccc1)-[#6](=O)-[#7]-[#6]-c1ccc(-[#8])cc1
: