Target
Vasopressin V2 receptor
Ligand
BDBM86210
Substrate
Ki
1544±n/a nM
Comments
PDSP_1429
Citation
 Cirillo, RGillio Tos, ESchwarz, MKQuattropani, AScheer, AMissotten, MDorbais, JNichols, ABorrelli, FGiachetti, CGolzio, LMarinelli, PThomas, RJChevillard, CLaurent, FPortet, KBarberis, CChollet, A Pharmacology of (2S,4Z)-N-[(2S)-2-hydroxy-2-phenylethyl]-4-(methoxyimino) -1-[(2'-methyl[1,1'-biphenyl]-4-yl)carbonyl]-2-pyrrolidinecarboxamide, a new potent and selective nonpeptide antagonist of the oxytocin receptor. J Pharmacol Exp Ther 306:253-61 (2003)  
Target
Name:
Vasopressin V2 receptor
Synonyms:
ADHR AVPR2 DIR Renal-type arginine vasopressin receptor V2R_HUMAN Vasopressin V2 receptor | Vasopressin receptor
Type:
Receptor
Mol. Mass.:
40295.28
Organism:
Homo sapiens (Human)
Description:
P30518
Residue:
371
  
Inhibitor
Name:
BDBM86210
Synonyms:
CAS_50-56-6 Oxytocin
Type:
Small organic molecule
Emp. Form.:
C43H66N12O12S2
Mol. Mass.:
1007.187
SMILES:
CCC(C)C1NC(=O)C(Cc2ccc(O)cc2)NC(=O)C(N)CSSCC(NC(=O)C(CC(N)=O)NC(=O)C(CCC(N)=O)NC1=O)C(=O)N1CCCC1C(=O)NC(CC(C)C)C(=O)NCC(N)=O
: