Target
Acetylcholine receptor subunit alpha
Ligand
BDBM50170601
Substrate
Ki
6000±n/a nM
Comments
PDSP_3056
Citation
 Cohen, CBergis, OEGalli, FLochead, AWJegham, SBiton, BLeonardon, JAvenet, PSgard, FBesnard, FGraham, DCoste, AOblin, ACuret, OVoltz, CGardes, ACaille, DPerrault, GGeorge, PSoubrie, PScatton, B SSR591813, a novel selective and partial alpha4beta2 nicotinic receptor agonist with potential as an aid to smoking cessation. J Pharmacol Exp Ther 306:407-20 (2003)  
Target
Name:
Acetylcholine receptor subunit alpha
Synonyms:
ACHA_HUMAN Acetylcholine receptor protein alpha chain CHNRA Cholinergic, Nicotinic Alpha1Beta1DeltaGamma Nicotinic acetylcholine receptor alpha-1/beta-1 Nicotinic acetylcholine receptor alpha2/beta4 n-AChR
Type:
Ion channel
Mol. Mass.:
54542.01
Organism:
Homo sapiens (Human)
Description:
Residue:
482
  
Inhibitor
Name:
BDBM50170601
Synonyms:
(1R,10S)-9-oxa-4,13-diazatetracyclo[11.2.1.0^{1,10}.0^{3,8}]hexadeca-3,5,7-triene SSR591813
Type:
Small organic molecule
Emp. Form.:
C13H16N2O
Mol. Mass.:
216.2789
SMILES:
C1C[C@@]23CN1CC[C@@H]2Oc1cccnc1C3
: