Target
Uncharacterized protein
Ligand
BDBM86242
Substrate
Ki
6900±n/a nM
Comments
PDSP_1928
Citation
 Vailati, SMoretti, MLonghi, RRovati, GEClementi, FGotti, C Developmental expression of heteromeric nicotinic receptor subtypes in chick retina. Mol Pharmacol 63:1329-37 (2003)  
Target
Name:
Uncharacterized protein
Synonyms:
Cholinergic, Nicotinic Alpha6Beta4
Type:
Enzyme Catalytic Domain
Mol. Mass.:
55323.77
Organism:
Chick
Description:
Cholinergic, Nicotinic Alpha6Beta4 0 Chick::F6Z813
Residue:
486
  
Inhibitor
Name:
BDBM86242
Synonyms:
CAS_64645 Tubocurarine,d
Type:
Small organic molecule
Emp. Form.:
C37H42N2O6
Mol. Mass.:
610.7381
SMILES:
COc1cc2CC[N+](C)(C)C3Cc4ccc(O)c(Oc5cc6C(Cc7ccc(Oc(c1O)c23)cc7)[NH+](C)CCc6cc5OC)c4
: