Target
Delta-type opioid receptor
Ligand
BDBM50000507
Substrate
Ki
48.3±n/a nM
Comments
PDSP_635
Citation
 Spetea, MTóth, FSchütz, JOtvös, FTóth, GBenyhe, SBorsodi, ASchmidhammer, H Binding characteristics of [3H]14-methoxymetopon, a high affinity mu-opioid receptor agonist. Eur J Neurosci 18:290-5 (2003)  
Target
Name:
Delta-type opioid receptor
Synonyms:
Cytochrome P450 3A4 Delta opioid receptor Delta-type opioid receptor (DOR) OPRD_RAT Opioid receptor Opioid receptors; mu & delta Ror-a | Voltage-gated potassium channel
Type:
G Protein-Coupled Receptor (GPCR)
Mol. Mass.:
40465.04
Organism:
Rattus norvegicus (rat)
Description:
Competition binding assays were using CHO-K1 cell membranes expressing the opioid receptor.
Residue:
372
  
Inhibitor
Name:
BDBM50000507
Synonyms:
(R)-2-[(S)-2-Amino-3-(4-hydroxy-2,6-dimethyl-phenyl)-propionylamino]-5-guanidino-pentanoic acid [(S)-1-(2-carbamoyl-ethylcarbamoyl)-2-phenyl-ethyl]-amide (S)-5-((S)-1-((S)-1-(2-amino-2-oxoethylamino)-3-methyl-1-oxobutan-2-ylamino)-3-methyl-1-oxobutan-2-ylamino)-4-((S)-2-((R)-2-((S)-2-amino-3-(4-hydroxyphenyl)propanamido)propanamido)-3-phenylpropanamido)-5-oxopentanoic acid 4-(2-{2-[2-Amino-3-(4-hydroxy-phenyl)-propionylamino]-propionylamino}-3-phenyl-propionylamino)-4-{1-[1-(carbamoylmethyl-carbamoyl)-2-methyl-propylcarbamoyl]-2-methyl-propylcarbamoyl}-butyric acid (deltorphin B) DELTORPHIN-II Tyr-D-Ala-Phe-Glu-Val-Val-GlyNH2
Type:
Small organic molecule
Emp. Form.:
C38H54N8O10
Mol. Mass.:
782.883
SMILES:
CC(C)[C@H](NC(=O)[C@@H](NC(=O)[C@H](CCC(O)=O)NC(=O)[C@H](Cc1ccccc1)NC(=O)[C@@H](C)NC(=O)[C@@H](N)Cc1ccc(O)cc1)C(C)C)C(=O)NCC(N)=O
: