Target
Mu-type opioid receptor
Ligand
BDBM86253
Substrate
Ki
1.18±n/a nM
Comments
PDSP_616
Citation
 Zhao, GMQian, XSchiller, PWSzeto, HH Comparison of [Dmt1]DALDA and DAMGO in binding and G protein activation at mu, delta, and kappa opioid receptors. J Pharmacol Exp Ther 307:947-54 (2003)  
Target
Name:
Mu-type opioid receptor
Synonyms:
M-OR-1 MOR-1 MUOR1 Mu opiate receptor OPRM1 hMOP | mu-type opioid receptor isoform MOR-1
Type:
G Protein-Coupled Receptor (GPCR)
Mol. Mass.:
44789.51
Organism:
Homo sapiens (Human)
Description:
P35372
Residue:
400
  
Inhibitor
Name:
BDBM86253
Synonyms:
CAS_100929-53-1 NSC_104742 | US10836728, Compound DAMGO
Type:
Small organic molecule
Emp. Form.:
C26H35N5O6
Mol. Mass.:
513.586
SMILES:
CC(NC(=O)C(N)Cc1ccc(O)cc1)C(=O)NCC(=O)N(C)C(Cc1ccccc1)C(=O)NCCO
: