Target
Protein kinase C alpha type
Ligand
BDBM86435
Substrate
Ki
3.57±n/a nM
Comments
PDSP_3232
Citation
 Wang, QJFang, TWYang, DLewin, NEVan Lint, JMarquez, VEBlumberg, PM Ligand structure-activity requirements and phospholipid dependence for the binding of phorbol esters to protein kinase D. Mol Pharmacol 64:1342-8 (2003)  
Target
Name:
Protein kinase C alpha type
Synonyms:
KPCA_HUMAN PKC alpha and beta-2 PKC-alpha PRKACA Protein Kinase C- alpha Protein kinase C alpha (PKCa) Protein kinase C alpha type (PRKCA) RAF proto-oncogene serine/threonine-protein kinase
Type:
Enzyme
Mol. Mass.:
76755.65
Organism:
Homo sapiens (Human)
Description:
The recombinant human PKC enzymes were produced using a baculovirus expression system in SF9 cells
Residue:
672
  
Inhibitor
Name:
BDBM86435
Synonyms:
B8-DL-B8 | B8-DL-B8 (low PS)
Type:
Small organic molecule
Emp. Form.:
C24H42O5
Mol. Mass.:
410.5873
SMILES:
CCC(C)(C\C=C1\CC(CO)(COC(=O)CC(C)(CC)C(C)C)OC1=O)C(C)C
: