Target
5-hydroxytryptamine receptor 7
Ligand
BDBM86441
Substrate
Ki
177±n/a nM
Comments
PDSP_3924
Citation
 Kimura, YHatanaka, KNaitou, YMaeno, KShimada, IKoakutsu, AWanibuchi, FYamaguchi, T Pharmacological profile of YM348, a novel, potent and orally active 5-HT2C receptor agonist. Eur J Pharmacol 483:37-43 (2004)  
Target
Name:
5-hydroxytryptamine receptor 7
Synonyms:
5-HT-7 5-HT7 5-HT7S 5HT7 HTR7 | Serotonin receptor 7
Type:
G Protein-Coupled Receptor (GPCR)
Mol. Mass.:
53573.08
Organism:
Homo sapiens (Human)
Description:
P34969
Residue:
479
  
Inhibitor
Name:
BDBM86441
Synonyms:
CAS_3045225 YM348
Type:
Small organic molecule
Emp. Form.:
C14H17N3O
Mol. Mass.:
243.3043
SMILES:
CCc1cc2c(ccc3cnn(CC(C)N)c23)o1
: