Target
Neuronal acetylcholine receptor subunit alpha-3
Ligand
BDBM86311
Substrate
Ki
37±n/a nM
Comments
PDSP_608
Citation
 Xiao, YKellar, KJ The comparative pharmacology and up-regulation of rat neuronal nicotinic receptor subtype binding sites stably expressed in transfected mammalian cells. J Pharmacol Exp Ther 310:98-107 (2004)  
Target
Name:
Neuronal acetylcholine receptor subunit alpha-3
Synonyms:
ACHA3_RAT Chrna3
Type:
Enzyme
Mol. Mass.:
56995.52
Organism:
Rattus norvegicus (Rat)
Description:
P04757
Residue:
499
  
Inhibitor
Name:
BDBM86311
Synonyms:
CAS_485-35-8 Cytisine-(-) US11667638, Example Cytisine
Type:
Small organic molecule
Emp. Form.:
C11H14N2O
Mol. Mass.:
190.2417
SMILES:
O=c1cccc2C3CNCC(C3)Cn12
: