Target
Kappa-type opioid receptor
Ligand
BDBM86258
Substrate
Ki
32.8±n/a nM
Comments
PDSP_1250
Citation
 Gilbert, AKHosztafi, SMahurter, LPasternak, GW Pharmacological characterization of dihydromorphine, 6-acetyldihydromorphine and dihydroheroin analgesia and their differentiation from morphine. Eur J Pharmacol 492:123-30 (2004)  
Target
Name:
Kappa-type opioid receptor
Synonyms:
K-OR-1 OPIATE Kappa OPRK1 | OPRK_BOVIN
Type:
Enzyme Catalytic Domain
Mol. Mass.:
42629.84
Organism:
CALF
Description:
Q2KIP6
Residue:
380
  
Inhibitor
Name:
BDBM86258
Synonyms:
CAS_23552-18-3 NSC_5980
Type:
Small organic molecule
Emp. Form.:
C17H19NO3
Mol. Mass.:
285.3377
SMILES:
CN1CCC23C4Oc5c2c(CC1C3C=CC4O)ccc5O
: