Target
Sphingosine 1-phosphate receptor 4
Ligand
BDBM22202
Substrate
Ki
33±n/a nM
Comments
PDSP_3978
Citation
 Fossetta, JDeno, GGonsiorek, WFan, XLavey, BDas, PLunn, CZavodny, PJLundell, DHipkin, RW Pharmacological characterization of human S1P4 using a novel radioligand, [4,5-3H]-dihydrosphingosine-1-phosphate. Br J Pharmacol 142:851-60 (2004)  
Target
Name:
Sphingosine 1-phosphate receptor 4
Synonyms:
EDG6 S1P receptor 4 S1P4 S1PR4_HUMAN Sphingosine 1-phosphate receptor Edg-6 sphingosine-1-phosphate 4 S1P4
Type:
G Protein-Coupled Receptor (GPCR)
Mol. Mass.:
41647.39
Organism:
Homo sapiens (Human)
Description:
Residue:
384
  
Inhibitor
Name:
BDBM22202
Synonyms:
S1P [33P]S1P sphingosine-1-phosphate, 32P labeled {[(4Z)-2-amino-3-hydroxyoctadec-4-en-1-yl]oxy}phosphonic acid
Type:
radiolabeled ligand
Emp. Form.:
C18H38NO5P
Mol. Mass.:
379.4718
SMILES:
CCCCCCCCCCCCC\C=C/C(O)C(N)COP(O)(O)=O
: