Target
5-hydroxytryptamine receptor 2A
Ligand
BDBM86525
Substrate
Ki
22.39±n/a nM
Comments
PDSP_5210
Citation
 Knight, ARMisra, AQuirk, KBenwell, KRevell, DKennett, GBickerdike, M Pharmacological characterisation of the agonist radioligand binding site of 5-HT(2A), 5-HT(2B) and 5-HT(2C) receptors. Naunyn Schmiedebergs Arch Pharmacol 370:114-23 (2004)  
Target
Name:
5-hydroxytryptamine receptor 2A
Synonyms:
5-HT-2 5-HT2A 5-hydroxytryptamine receptor 2A (5HT-2A) 5HT2A_HUMAN HTR2A | Serotonin receptor 2A
Type:
undefined
Mol. Mass.:
52607.65
Organism:
Homo sapiens (Human)
Description:
P28223
Residue:
471
  
Inhibitor
Name:
BDBM86525
Synonyms:
AMI-193 CHEMBL79834 | NSC_77445
Type:
Small organic molecule
Emp. Form.:
C22H26FN3O2
Mol. Mass.:
383.4591
SMILES:
Fc1ccc(OCCCN2CCC3(CC2)N(CNC3=O)c2ccccc2)cc1
: