Target
D(3) dopamine receptor
Ligand
BDBM82478
Substrate
Ki
153±n/a nM
Comments
PDSP_1298
Citation
 Burstein, ESMa, JWong, SGao, YPham, EKnapp, AENash, NROlsson, RDavis, REHacksell, UWeiner, DMBrann, MR Intrinsic efficacy of antipsychotics at human D2, D3, and D4 dopamine receptors: identification of the clozapine metabolite N-desmethylclozapine as a D2/D3 partial agonist. J Pharmacol Exp Ther 315:1278-87 (2005)  
Target
Name:
D(3) dopamine receptor
Synonyms:
DOPAMINE D3 DRD3_HUMAN Dopamine D3 receptor (D3) Dopamine receptor Dopamine receptor D3
Type:
Mol. Mass.:
44243.43
Organism:
Homo sapiens (Human)
Description:
Residue:
400
  
Inhibitor
Name:
BDBM82478
Synonyms:
CAS_2820 NSC_2820
Type:
Small organic molecule
Emp. Form.:
C17H17ClN4
Mol. Mass.:
312.797
SMILES:
Clc1ccc2N=c3ccccc3=C(Nc2c1)N1CCNCC1
: