Target
Kappa-type opioid receptor
Ligand
BDBM86493
Substrate
Ki
0.81±n/a nM
Comments
PDSP_2945
Citation
 Ghirmai, SAzar, MRPolgar, WEBerzetei-Gurske, ICashman, JR Synthesis and biological evaluation of alpha- and beta-6-amido derivatives of 17-cyclopropylmethyl-3, 14beta-dihydroxy-4, 5alpha-epoxymorphinan: potential alcohol-cessation agents. J Med Chem 51:1913-24 (2008)  
Target
Name:
Kappa-type opioid receptor
Synonyms:
K-OR-1 Kappa-opioid receptor (KOR) Kappa-type opioid receptor (KOR) OPIATE Kappa OPRK1 kappa opioid receptor (KOR)
Type:
G Protein-Coupled Receptor (GPCR)
Mol. Mass.:
42648.76
Organism:
Homo sapiens (Human)
Description:
P41145
Residue:
380
  
Inhibitor
Name:
BDBM86493
Synonyms:
CAS_27943 NSC_27943 | Naltrexone
Type:
Small organic molecule
Emp. Form.:
C20H23NO4
Mol. Mass.:
341.4009
SMILES:
Oc1ccc2CC3N(CC4CC4)CCC45C(Oc1c24)C(=O)CCC35O
: