Target
Mu-type opioid receptor
Ligand
BDBM86933
Substrate
Ki
0.43±n/a nM
Comments
PDSP_8443
Citation
 Ghirmai, SAzar, MRPolgar, WEBerzetei-Gurske, ICashman, JR Synthesis and biological evaluation of alpha- and beta-6-amido derivatives of 17-cyclopropylmethyl-3, 14beta-dihydroxy-4, 5alpha-epoxymorphinan: potential alcohol-cessation agents. J Med Chem 51:1913-24 (2008)  
Target
Name:
Mu-type opioid receptor
Synonyms:
M-OR-1 MOR-1 MUOR1 Mu opiate receptor OPRM1 hMOP | mu-type opioid receptor isoform MOR-1
Type:
G Protein-Coupled Receptor (GPCR)
Mol. Mass.:
44789.51
Organism:
Homo sapiens (Human)
Description:
P35372
Residue:
400
  
Inhibitor
Name:
BDBM86933
Synonyms:
17-cyclopropylmethyl-3,14-beta-dihydroxy-4,5-alpha-epoxy-6-alpha-[(thiophen-2'-yl)acetamido]morphinan CAS_24822459 NSC_24822459 | NSC_24822965
Type:
Small organic molecule
Emp. Form.:
C26H30N2O4S
Mol. Mass.:
466.592
SMILES:
Oc1ccc2CC3N(CC4CC4)CCC45C(Oc1c24)C(CCC35O)NC(=O)Cc1cccs1
: