Target
Botulinum neurotoxin type F
Ligand
BDBM53136
Substrate
Meas. Tech.
High-throughput multiplex microsphere dose response for inhibitors of toxin protease, specifically Botulinum neurotoxin light chain F protease, compounds from Cherry Pick 01
EC50
>20000±n/a nM
Citation
 PubChem, PC High-throughput multiplex microsphere dose response for inhibitors of toxin protease, specifically Botulinum neurotoxin light chain F protease, compounds from Cherry Pick 01 PubChem Bioassay (2012)[AID] 
Target
Name:
Botulinum neurotoxin type F
Synonyms:
BXF_CLOBO botulinum neurotoxin type F, BoNT/F
Type:
Enzyme Catalytic Domain
Mol. Mass.:
146691.56
Organism:
Clostridium botulinum Bf
Description:
P30996
Residue:
1274
  
Inhibitor
Name:
BDBM53136
Synonyms:
(9-amino-7-ethoxy-acridin-3-yl)-p-anisyl-amine 7-ethoxy-N3-[(4-methoxyphenyl)methyl]acridine-3,9-diamine SMR000539104 | cid_2885134
Type:
Small organic molecule
Emp. Form.:
C23H23N3O2
Mol. Mass.:
373.4476
SMILES:
CCOc1ccc2nc3cc(NCc4ccc(OC)cc4)ccc3c(N)c2c1
: