Target
Lethal factor
Ligand
BDBM53136
Substrate
Meas. Tech.
High-throughput multiplex microsphere dose response for inhibitors of toxin protease, specifically Lethal Factor protease, compounds from Cherry Pick 01
EC50
>20000±n/a nM
Citation
 PubChem, PC High-throughput multiplex microsphere dose response for inhibitors of toxin protease, specifically Lethal Factor protease, compounds from Cherry Pick 01 PubChem Bioassay (2012)[AID] 
Target
Name:
Lethal factor
Synonyms:
Anthrax Lethal Factor (LF) Antrax lethal toxin lef | lethal factor
Type:
PROTEIN
Mol. Mass.:
93758.56
Organism:
Bacillus anthracis
Description:
ChEMBL_1460338
Residue:
809
  
Inhibitor
Name:
BDBM53136
Synonyms:
(9-amino-7-ethoxy-acridin-3-yl)-p-anisyl-amine 7-ethoxy-N3-[(4-methoxyphenyl)methyl]acridine-3,9-diamine SMR000539104 | cid_2885134
Type:
Small organic molecule
Emp. Form.:
C23H23N3O2
Mol. Mass.:
373.4476
SMILES:
CCOc1ccc2nc3cc(NCc4ccc(OC)cc4)ccc3c(N)c2c1
: