Target
Lethal factor
Ligand
BDBM88697
Substrate
Meas. Tech.
High-throughput multiplex microsphere dose response for inhibitors of toxin protease, specifically Lethal Factor protease, compounds from Cherry Pick 02
EC50
>20000±n/a nM
Citation
 PubChem, PC High-throughput multiplex microsphere dose response for inhibitors of toxin protease, specifically Lethal Factor protease, compounds from Cherry Pick 02 PubChem Bioassay (2012)[AID] 
Target
Name:
Lethal factor
Synonyms:
Anthrax Lethal Factor (LF) Antrax lethal toxin lef | lethal factor
Type:
PROTEIN
Mol. Mass.:
93758.56
Organism:
Bacillus anthracis
Description:
ChEMBL_1460338
Residue:
809
  
Inhibitor
Name:
BDBM88697
Synonyms:
4-hydroxybenzoic acid [2-(7-ethyl-1H-indol-3-yl)-2-keto-ethyl] ester MLS000393645 [2-(7-ethyl-1H-indol-3-yl)-2-oxidanylidene-ethyl] 4-oxidanylbenzoate cid_2127357
Type:
Small organic molecule
Emp. Form.:
C19H17NO4
Mol. Mass.:
323.3426
SMILES:
CCc1cccc2c(c[nH]c12)C(=O)COC(=O)c1ccc(O)cc1
: