Target
Lethal factor
Ligand
BDBM88703
Substrate
Meas. Tech.
High-throughput multiplex microsphere dose response for inhibitors of toxin protease, specifically Lethal Factor protease, compounds from Cherry Pick 02
EC50
>20000±n/a nM
Citation
 PubChem, PC High-throughput multiplex microsphere dose response for inhibitors of toxin protease, specifically Lethal Factor protease, compounds from Cherry Pick 02 PubChem Bioassay (2012)[AID] 
Target
Name:
Lethal factor
Synonyms:
Anthrax Lethal Factor (LF) Antrax lethal toxin lef | lethal factor
Type:
PROTEIN
Mol. Mass.:
93758.56
Organism:
Bacillus anthracis
Description:
ChEMBL_1460338
Residue:
809
  
Inhibitor
Name:
BDBM88703
Synonyms:
MLS002171722 N-[2-(4-methoxyphenyl)-2-pyrrolidin-1-yl-ethyl]-2-methyl-5-piperidin-1-ylsulfonyl-benzamide N-[2-(4-methoxyphenyl)-2-pyrrolidino-ethyl]-2-methyl-5-piperidinosulfonyl-benzamide cid_16303937
Type:
Small organic molecule
Emp. Form.:
C26H35N3O4S
Mol. Mass.:
485.639
SMILES:
COc1ccc(cc1)C(CNC(=O)c1cc(ccc1C)S(=O)(=O)N1CCCCC1)N1CCCC1
: