Target
Isocitrate dehydrogenase [NADP] cytoplasmic [R132H]
Ligand
BDBM278705
Substrate
Meas. Tech.
Inhibitory Activity Against IDH1R132H and IDH1R132C Enzymes
pH
7.5±n/a
Temperature
298.15±n/a K
IC50
37±n/a nM
Comments
extracted
Citation
 Saito, SItoh, MFujisawa, TSaito, HKiyotsuka, YWatanabe, HMatsunaga, HKagoshima, YSuzuki, TOgawara, YKitabayashi, K Isoxazole derivative as mutant isocitrate dehydrogenase 1 inhibitor US Patent  US10040791 Publication Date 8/7/2018 
Target
Name:
Isocitrate dehydrogenase [NADP] cytoplasmic [R132H]
Synonyms:
Cytosolic NADP-isocitrate dehydrogenase (IDH1)(R132H) IDH1 R132H IDHC_HUMAN Isocitrate dehydrogenase 1 mutant (R132H) Isocitrate dehydrogenase [NADP] cytoplasmic (IDH1)(R132H) PICD
Type:
Protein
Mol. Mass.:
46641.74
Organism:
Homo sapiens (Human)
Description:
Human IDH1 R132H (SEQ ID No. 2 in patent). First three are removed. Google patent parsed wrong.
Residue:
414
  
Inhibitor
Name:
BDBM278705
Synonyms:
3-{[5-tert-Butyl-3-(2,4,6-trichlorophenyl)-1,2-oxazol-4-yl]carbonyl}-1-methyl-1H-benzo[g]indole-8-carboxylic acid | US10040791, Example 167
Type:
Small organic molecule
Emp. Form.:
C28H21Cl3N2O4
Mol. Mass.:
555.836
SMILES:
Cn1cc(C(=O)c2c(noc2C(C)(C)C)-c2c(Cl)cc(Cl)cc2Cl)c2ccc3ccc(cc3c12)C(O)=O
: