Target
Lethal factor
Ligand
BDBM91563
Substrate
Meas. Tech.
High-throughput multiplex microsphere dose response for inhibitors of toxin protease, specifically Lethal Factor protease, compounds from Powder Set 01
EC50
>20000±n/a nM
Citation
 PubChem, PC High-throughput multiplex microsphere dose response for inhibitors of toxin protease, specifically Lethal Factor protease, compounds from Powder Set 01 PubChem Bioassay (2012)[AID] 
Target
Name:
Lethal factor
Synonyms:
Anthrax Lethal Factor (LF) Antrax lethal toxin lef | lethal factor
Type:
PROTEIN
Mol. Mass.:
93758.56
Organism:
Bacillus anthracis
Description:
ChEMBL_1460338
Residue:
809
  
Inhibitor
Name:
BDBM91563
Synonyms:
3-(2-furanyl)-2,5-diphenyl-3,4-dihydropyrazole 5-(2-furyl)-1,3-diphenyl-2-pyrazoline cid_561651
Type:
Small organic molecule
Emp. Form.:
C19H16N2O
Mol. Mass.:
288.3431
SMILES:
C1C(N(N=C1c1ccccc1)c1ccccc1)c1ccco1
: