Target
Lethal factor
Ligand
BDBM88709
Substrate
Meas. Tech.
High-throughput multiplex microsphere dose response for inhibitors of toxin protease, specifically Lethal Factor protease, compounds from Powder Set 01
EC50
>20000±n/a nM
Citation
 PubChem, PC High-throughput multiplex microsphere dose response for inhibitors of toxin protease, specifically Lethal Factor protease, compounds from Powder Set 01 PubChem Bioassay (2012)[AID] 
Target
Name:
Lethal factor
Synonyms:
Anthrax Lethal Factor (LF) Antrax lethal toxin lef | lethal factor
Type:
PROTEIN
Mol. Mass.:
93758.56
Organism:
Bacillus anthracis
Description:
ChEMBL_1460338
Residue:
809
  
Inhibitor
Name:
BDBM88709
Synonyms:
2-phenyl-1-(2-pyridinyl)ethanone 2-phenyl-1-pyridin-2-yl-ethanone MLS002706427 US20230364057, Compound 213 | cid_256073
Type:
Small organic molecule
Emp. Form.:
C13H11NO
Mol. Mass.:
197.2325
SMILES:
O=C(Cc1ccccc1)c1ccccn1
: