Target
Botulinum neurotoxin type F
Ligand
BDBM91540
Substrate
Meas. Tech.
High-throughput multiplex microsphere dose response for inhibitors of toxin protease, specifically Botulinum neurotoxin light chain F protease, compounds from Powder Set 01
EC50
>20000±n/a nM
Citation
 PubChem, PC High-throughput multiplex microsphere dose response for inhibitors of toxin protease, specifically Botulinum neurotoxin light chain F protease, compounds from Powder Set 01 PubChem Bioassay (2012)[AID] 
Target
Name:
Botulinum neurotoxin type F
Synonyms:
BXF_CLOBO botulinum neurotoxin type F, BoNT/F
Type:
Enzyme Catalytic Domain
Mol. Mass.:
146691.56
Organism:
Clostridium botulinum Bf
Description:
P30996
Residue:
1274
  
Inhibitor
Name:
BDBM91540
Synonyms:
2-(3,5-diphenyl-2-pyrazolin-1-yl)-4-methyl-thiazole 2-(3,5-diphenyl-3,4-dihydropyrazol-2-yl)-4-methylthiazole cid_17587447
Type:
Small organic molecule
Emp. Form.:
C19H17N3S
Mol. Mass.:
319.423
SMILES:
Cc1csc(n1)N1N=C(CC1c1ccccc1)c1ccccc1
: