Target
Botulinum neurotoxin type F
Ligand
BDBM91551
Substrate
Meas. Tech.
High-throughput multiplex microsphere dose response for inhibitors of toxin protease, specifically Botulinum neurotoxin light chain F protease, compounds from Powder Set 01
EC50
>20000±n/a nM
Citation
 PubChem, PC High-throughput multiplex microsphere dose response for inhibitors of toxin protease, specifically Botulinum neurotoxin light chain F protease, compounds from Powder Set 01 PubChem Bioassay (2012)[AID] 
Target
Name:
Botulinum neurotoxin type F
Synonyms:
BXF_CLOBO botulinum neurotoxin type F, BoNT/F
Type:
Enzyme Catalytic Domain
Mol. Mass.:
146691.56
Organism:
Clostridium botulinum Bf
Description:
P30996
Residue:
1274
  
Inhibitor
Name:
BDBM91551
Synonyms:
3-(4-chlorophenyl)-2,5-diphenyl-3,4-dihydropyrazole VU0466987-1 | cid_248777
Type:
Small organic molecule
Emp. Form.:
C21H17ClN2
Mol. Mass.:
332.826
SMILES:
Clc1ccc(cc1)C1CC(=NN1c1ccccc1)c1ccccc1
: