Target
Botulinum neurotoxin type F
Ligand
BDBM54597
Substrate
Meas. Tech.
High-throughput multiplex microsphere dose response for inhibitors of toxin protease, specifically Botulinum neurotoxin light chain F protease, compounds from Powder Set 01
EC50
>20000±n/a nM
Citation
 PubChem, PC High-throughput multiplex microsphere dose response for inhibitors of toxin protease, specifically Botulinum neurotoxin light chain F protease, compounds from Powder Set 01 PubChem Bioassay (2012)[AID] 
Target
Name:
Botulinum neurotoxin type F
Synonyms:
BXF_CLOBO botulinum neurotoxin type F, BoNT/F
Type:
Enzyme Catalytic Domain
Mol. Mass.:
146691.56
Organism:
Clostridium botulinum Bf
Description:
P30996
Residue:
1274
  
Inhibitor
Name:
BDBM54597
Synonyms:
1-(m-tolyl)-3,5-diphenyl-2-pyrazoline UNM-0000305835 | cid_2841247
Type:
Small organic molecule
Emp. Form.:
C22H20N2
Mol. Mass.:
312.4076
SMILES:
Cc1cccc(c1)N1N=C(CC1c1ccccc1)c1ccccc1
: