Target
Botulinum neurotoxin type F
Ligand
BDBM91568
Substrate
Meas. Tech.
High-throughput multiplex microsphere dose response for inhibitors of toxin protease, specifically Botulinum neurotoxin light chain F protease, compounds from Powder Set 01
EC50
>20000±n/a nM
Citation
 PubChem, PC High-throughput multiplex microsphere dose response for inhibitors of toxin protease, specifically Botulinum neurotoxin light chain F protease, compounds from Powder Set 01 PubChem Bioassay (2012)[AID] 
Target
Name:
Botulinum neurotoxin type F
Synonyms:
BXF_CLOBO botulinum neurotoxin type F, BoNT/F
Type:
Enzyme Catalytic Domain
Mol. Mass.:
146691.56
Organism:
Clostridium botulinum Bf
Description:
P30996
Residue:
1274
  
Inhibitor
Name:
BDBM91568
Synonyms:
N-cyclopropyl-2,3-bis(2-thienyl)quinoxaline-6-carboxamide N-cyclopropyl-2,3-dithiophen-2-yl-quinoxaline-6-carboxamide VU0467054-1 | cid_3411564
Type:
Small organic molecule
Emp. Form.:
C20H15N3OS2
Mol. Mass.:
377.483
SMILES:
O=C(NC1CC1)c1ccc2nc(-c3cccs3)c(nc2c1)-c1cccs1
: