Target
Plasminogen activator inhibitor 1
Ligand
BDBM92479
Substrate
Meas. Tech.
Enzymatic Assay
pH
7.8±0
Temperature
296.15±0 K
IC50
7± 1 nM
Citation
 Cale, JMLi, SHWarnock, MSu, EJNorth, PRSanders, KLPuscau, MMEmal, CDLawrence, DA Characterization of a novel class of polyphenolic inhibitors of plasminogen activator inhibitor-1. J Biol Chem 285:7892-902 (2010)  
Target
Name:
Plasminogen activator inhibitor 1
Synonyms:
Endothelial plasminogen activator inhibitor PAI-1 PAI1_HUMAN Plasminogen activator inhibitor 1 Plasminogen activator inhibitor-1 SERPINE1
Type:
Enzyme
Mol. Mass.:
45064.00
Organism:
Homo sapiens (Human)
Description:
P05121
Residue:
402
  
Inhibitor
Name:
BDBM92479
Synonyms:
Tannic Acid, A | Tannic acid
Type:
Large molecule
Emp. Form.:
C76H52O46
Mol. Mass.:
1701.1985
SMILES:
Oc1cc(cc(O)c1O)C(=O)Oc1cc(cc(O)c1O)C(=O)OCC1OC(OC(=O)c2cc(O)c(O)c(OC(=O)c3cc(O)c(O)c(O)c3)c2)C(OC(=O)c2cc(O)c(O)c(OC(=O)c3cc(O)c(O)c(O)c3)c2)C(OC(=O)c2cc(O)c(O)c(OC(=O)c3cc(O)c(O)c(O)c3)c2)C1OC(=O)c1cc(O)c(O)c(OC(=O)c2cc(O)c(O)c(O)c2)c1
: