Target
5-hydroxytryptamine receptor 3A
Ligand
BDBM221526
Substrate
Meas. Tech.
5HT3 In Vitro Assay
Temperature
310.15±n/a K
IC50
0.57±n/a nM
Comments
extracted
Citation
 Hitchcock, SMonenschein, HReichard, HSun, HKikuchi, SMacklin, THopkins, M 5-HT3 receptor antagonists US Patent  US9695195 Publication Date 7/4/2017 
Target
Name:
5-hydroxytryptamine receptor 3A
Synonyms:
5-HT-3 5-HT3A 5-hydroxytryptamine receptor 3 (5-HT3) 5-hydroxytryptamine receptor 3A (5HT3A) 5HT3R HTR3A Serotonin 3 receptor (5HT3) Serotonin-gated ion channel receptor | Serotonin-gated ion channel receptor 3
Type:
Protein
Mol. Mass.:
55283.27
Organism:
Homo sapiens (Human)
Description:
P46098
Residue:
478
  
Inhibitor
Name:
BDBM221526
Synonyms:
US9303045, 10 US9695195, 111
Type:
Small organic molecule
Emp. Form.:
C20H27N3O4S
Mol. Mass.:
405.511
SMILES:
CC(C)S(=O)(=O)n1cc(C(=O)NC2CC3COCC(C2)N3C)c2ccccc12
: