Target
Peptide deformylase
Ligand
BDBM92766
Substrate
Meas. Tech.
Binding Assay
Ki
53.7±0.0 nM
Citation
 Totoritis, RDuraiswami, CTaylor, ANKerrigan, JJCampobasso, NSmith, KJWard, PKing, BWMurrayz-Thompson, MJones, ADVan Aller, GSAubart, KMZalacain, MThrall, SHMeek, TDSchwartz, B Understanding the origins of time-dependent inhibition by polypeptide deformylase inhibitors. Biochemistry 50:6642-54 (2011)  
Target
Name:
Peptide deformylase
Synonyms:
DEF_STRR6 Polypeptide Deformylase def
Type:
Enzyme
Mol. Mass.:
22684.24
Organism:
Streptococcus pneumoniae (strain ATCC BAA-255 / R6)
Description:
The pdf gene from S. pneumoniae was cloned and protein was expressed and purified from E. coli BL21(DE3).
Residue:
203
  
Inhibitor
Name:
BDBM92766
Synonyms:
PDF inhibitor, compound 8
Type:
Small molecule
Emp. Form.:
C26H31ClN8O3S
Mol. Mass.:
571.094
SMILES:
Cc1ccccc1Nc1nc(nc(n1)N1CCN(CC1)c1ccccc1Cl)N1CSC[C@H]1COCC(=O)NO
: