Target
Protein kinase C alpha type
Ligand
BDBM92976
Substrate
Meas. Tech.
Mixed Micelle Assay
pH
7.5±0
Temperature
303.15±0 K
IC50
1.5e+4±n/a nM
Citation
 Bottega, REpand, RM Inhibition of protein kinase C by cationic amphiphiles. Biochemistry 31:9025-30 (1992)  
Target
Name:
Protein kinase C alpha type
Synonyms:
KPCA_RAT Prkca Protein kinase C alpha | Protein kinase C alpha type
Type:
Protein
Mol. Mass.:
76797.67
Organism:
Rattus norvegicus (Rat)
Description:
P05696
Residue:
672
  
Inhibitor
Name:
BDBM92976
Synonyms:
Amphiphile, XI
Type:
Small molecule
Emp. Form.:
C36H66N4O5
Mol. Mass.:
634.9319
SMILES:
CC(C)CCCC(N)C1CCN2C3OC=C4CC(CCC4(C)C3CCC12C)OC(=O)CCC(=O)OC(C[NH+](C)C)C[N+](C)(C)C
: