Target
Protein kinase C alpha type
Ligand
BDBM92979
Substrate
Meas. Tech.
Mixed Micelle Assay
pH
7.5±0
Temperature
303.15±0 K
IC50
2.6e+4±n/a nM
Citation
 Bottega, REpand, RM Inhibition of protein kinase C by cationic amphiphiles. Biochemistry 31:9025-30 (1992)  
Target
Name:
Protein kinase C alpha type
Synonyms:
KPCA_RAT Prkca Protein kinase C alpha | Protein kinase C alpha type
Type:
Protein
Mol. Mass.:
76797.67
Organism:
Rattus norvegicus (Rat)
Description:
P05696
Residue:
672
  
Inhibitor
Name:
BDBM92979
Synonyms:
Amphiphile, XVI
Type:
Small molecule
Emp. Form.:
C30H64N2O2
Mol. Mass.:
484.8403
SMILES:
(=O)OC(C[NH+](C)C)C[N+](C)(C)C
: