Target
Bifunctional aspartokinase/homoserine dehydrogenase 1
Ligand
BDBM92991
Substrate
Meas. Tech.
Inhibition Assay
Ki
24000000±3000000 nM
Citation
 Angeles, TSHunsley, JRViola, RE Reversal of enzyme regiospecificity with alternative substrates for aspartokinase I from Escherichia coli. Biochemistry 31:799-805 (1992)  
Target
Name:
Bifunctional aspartokinase/homoserine dehydrogenase 1
Synonyms:
AK1H_ECOLI Bifunctional aspartokinase/homoserine dehydrogenase 1 thrA1 | thrA2
Type:
Protein
Mol. Mass.:
89109.15
Organism:
Escherichia coli
Description:
P00561
Residue:
820
  
Inhibitor
Name:
BDBM92991
Synonyms:
L-norleucine
Type:
Small molecule
Emp. Form.:
C6H12NO2
Mol. Mass.:
130.1655
SMILES:
CCCC[C@H](N)C([O-])=O
: