Target
Glucose-1-phosphate thymidylyltransferase
Ligand
BDBM93081
Substrate
Meas. Tech.
Inhibition Assay
IC50
1.14e+3± 1.9e+2 nM
Citation
 Alphey, MSPirrie, LTorrie, LSBoulkeroua, WAGardiner, MSarkar, AMaringer, MOehlmann, WBrenk, RScherman, MSMcNeil, MRejzek, MField, RASingh, MGray, DWestwood, NJNaismith, JH Allosteric competitive inhibitors of the glucose-1-phosphate thymidylyltransferase (RmlA) from Pseudomonas aeruginosa. ACS Chem Biol 8:387-96 (2013)  
Target
Name:
Glucose-1-phosphate thymidylyltransferase
Synonyms:
Glucose-1-phosphate thymidylyltransferase (RmlA)
Type:
Protein
Mol. Mass.:
32451.00
Organism:
Pseudomonas aeruginosa
Description:
Q9HU22
Residue:
293
  
Inhibitor
Name:
BDBM93081
Synonyms:
Analogue of 1a, 2
Type:
Small molecule
Emp. Form.:
C11H11N3O3
Mol. Mass.:
233.2233
SMILES:
Nc1c(O)n(Cc2ccccc2)c(=O)[nH]c1=O
: