Target
Sigma non-opioid intracellular receptor 1
Ligand
BDBM93157
Substrate
Meas. Tech.
Binding Assay
Ki
1.4±0.0 nM
Citation
 Yous, SWallez, VBelloir, MCaignard, DHMcCurdy, CRPoupaert, JH Novel 2(3H)-benzothiazolones as highly potent and selective sigma-1 receptor ligands Medicinal Chemistry Research 14:158-168 (2005)    Article 
Target
Name:
Sigma non-opioid intracellular receptor 1
Synonyms:
OPRS1 SIGMAR1 Sigma non-opioid intracellular receptor 1 Sigma1-receptor Sterol isomerase-like protein
Type:
Protein
Mol. Mass.:
25307.17
Organism:
Cavia porcellus (Guinea pig)
Description:
Q60492
Residue:
223
  
Inhibitor
Name:
BDBM93157
Synonyms:
3-{2-[(3aR,6aS)-3a,6a-dimethyl-octahydrocyclopenta[c]pyrrol-2-yl]ethyl}-6-propyl-2,3-dihydro-1,3-benzothiazol-2-one, 13
Type:
Small molecule
Emp. Form.:
C21H30N2OS
Mol. Mass.:
358.541
SMILES:
CCCc1ccc2n(CCN3C[C@@]4(C)CCC[C@@]4(C)C3)c(=O)sc2c1
: