Target
5-hydroxytryptamine receptor 6
Ligand
BDBM93400
Substrate
Meas. Tech.
Radioligand Binding Assay
Ki
16.7±0 nM
IC50
35.9±0.0 nM
Citation
 Ivachtchenko, AVGolovina, ESKadieva, MGKoryakova, AGKovalenko, SMMitkin, ODOkun, IMRavnyeyko, IMTkachenko, SEZaremba, OV Solution phase parallel synthesis of substituted 3-phenylsulfonyl-[1,2,3]triazolo[1,5-a]quinazolines: selective serotonin 5-HT(6) receptor antagonists. J Comb Chem 12:445-52 (2010)  
Target
Name:
5-hydroxytryptamine receptor 6
Synonyms:
5-HT-6 5-hydroxytryptamine receptor 6 (5-HT-6) 5-hydroxytryptamine receptor 6 (5HT6) HTR6 Serotonin 6 (5-HT6) receptor | Serotonin Receptor 6
Type:
G Protein-Coupled Receptor (GPCR)
Mol. Mass.:
46968.43
Organism:
Homo sapiens (Human)
Description:
P50406
Residue:
440
  
Inhibitor
Name:
BDBM93400
Synonyms:
PSTQ Analog, 3{8,4}
Type:
Small molecule
Emp. Form.:
C21H23N5O2S
Mol. Mass.:
409.505
SMILES:
CCC(C)Nc1nc2c(nnn2c2ccccc12)S(=O)(=O)c1cc(C)ccc1C
: