Target
Neuropilin-1
Ligand
BDBM94118
Substrate
IC50
>95000±n/a nM
Citation
 PubChem, PC Dose Response confirmation of small molecule modulators of the interaction between CendR and NRP-1 in a panel assay PubChem Bioassay (2012)[AID] 
Target
Name:
Neuropilin-1
Synonyms:
Chain A, Crystal Structure Of The B1b2 Domains From Human Neuropilin- 1 NRP1 Neuropilin-1 | VEGF165R
Type:
PROTEIN
Mol. Mass.:
103122.09
Organism:
Homo sapiens (Human)
Description:
ChEMBL_617636
Residue:
923
  
Inhibitor
Name:
BDBM94118
Synonyms:
(+)-(2S,4S,5R,6S)-2-(2-Hydroxyethyl)-1,7-dioxaspiro[5.5]undecane-4,5-diol MLS000517553 cid_16066518
Type:
Small organic molecule
Emp. Form.:
C11H20O5
Mol. Mass.:
232.2735
SMILES:
OCC[C@H]1C[C@H](O)[C@@H](O)[C@]2(CCCCO2)O1
: