Target
Xylosyl- and glucuronyltransferase LARGE1
Ligand
BDBM94707
Substrate
EC50
22600±n/a nM
Citation
 PubChem, PC Dose response confirmation of small molecule activators of alpha dystroglycan glycosylation PubChem Bioassay (2012)[AID] 
Target
Name:
Xylosyl- and glucuronyltransferase LARGE1
Synonyms:
KIAA0609 LARGE | LARGE1
Type:
Enzyme Catalytic Domain
Mol. Mass.:
88079.63
Organism:
Homo sapiens (Human)
Description:
gi_47678551
Residue:
756
  
Inhibitor
Name:
BDBM94707
Synonyms:
2-[4-[1-[1-(2-thenyl)tetrazol-5-yl]propyl]piperazino]-1,3-benzothiazole 2-[4-[1-[1-(thiophen-2-ylmethyl)-5-tetrazolyl]propyl]-1-piperazinyl]-1,3-benzothiazole 2-{4-[1-(1-Thiophen-2-ylmethyl-1H-tetrazol-5-yl)-propyl]-piperazin-1-yl}-benzothiazole SMR000005034 | cid_653717
Type:
Small organic molecule
Emp. Form.:
C20H23N7S2
Mol. Mass.:
425.574
SMILES:
CCC(N1CCN(CC1)c1nc2ccccc2s1)c1nnnn1Cc1cccs1
: