Target
Mitochondrial peptide methionine sulfoxide reductase
Ligand
BDBM71150
Substrate
IC50
>155182±n/a nM
Citation
 PubChem, PC Absorbance-based biochemical high throughput dose response assay to identify inhibitors of Methionine sulfoxide reductase A (MsrA) PubChem Bioassay (2013)[AID] 
Target
Name:
Mitochondrial peptide methionine sulfoxide reductase
Synonyms:
MSRA MSRA_BOVIN
Type:
Enzyme Catalytic Domain
Mol. Mass.:
25822.90
Organism:
Bos taurus
Description:
gi_73586699
Residue:
233
  
Inhibitor
Name:
BDBM71150
Synonyms:
2-Chloro-3-(4-hydroxy-phenylamino)-[1,4]naphthoquinone 2-chloro-3-(4-hydroxyanilino)-1,4-naphthoquinone MLS000778523 cid_260556
Type:
Small organic molecule
Emp. Form.:
C16H10ClNO3
Mol. Mass.:
299.708
SMILES:
Oc1ccc(NC2=C(Cl)C(=O)c3ccccc3C2=O)cc1
: