Target
Low molecular weight phosphotyrosine protein phosphatase
Ligand
BDBM95024
Substrate
IC50
12200±n/a nM
Citation
 PubChem, PC Dose response confirmation of small molecule inhibitors of Low Molecular Weight Protein Tyrosine Phosphatase, LMPTP, in an orthogonal absorbance-based assay PubChem Bioassay (2013)[AID] 
Target
Name:
Low molecular weight phosphotyrosine protein phosphatase
Synonyms:
3.1.3.2 ACP1 LMW-PTP LMWPTP PPAC_HUMAN low molecular weight phosphotyrosine protein phosphatase isoform c
Type:
Mol. Mass.:
18042.81
Organism:
Homo sapiens (Human)
Description:
P24666
Residue:
158
  
Inhibitor
Name:
BDBM95024
Synonyms:
4-[5-(5-bromo-2-chlorophenyl)-1,2,4-oxadiazol-3-yl]pyridine 5-(5-bromo-2-chloro-phenyl)-3-(4-pyridyl)-1,2,4-oxadiazole MLS000064295 cid_978001
Type:
Small organic molecule
Emp. Form.:
C13H7BrClN3O
Mol. Mass.:
336.571
SMILES:
Clc1ccc(Br)cc1-c1nc(no1)-c1ccncc1
: