Target
Low molecular weight phosphotyrosine protein phosphatase
Ligand
BDBM28879
Substrate
IC50
7210±n/a nM
Citation
 PubChem, PC Dose response confirmation of small molecule inhibitors of Low Molecular Weight Protein Tyrosine Phosphatase, LMPTP, in an orthogonal absorbance-based assay PubChem Bioassay (2013)[AID] 
Target
Name:
Low molecular weight phosphotyrosine protein phosphatase
Synonyms:
3.1.3.2 ACP1 LMW-PTP LMWPTP PPAC_HUMAN low molecular weight phosphotyrosine protein phosphatase isoform c
Type:
Mol. Mass.:
18042.81
Organism:
Homo sapiens (Human)
Description:
P24666
Residue:
158
  
Inhibitor
Name:
BDBM28879
Synonyms:
2-[(5Z)-5-[(3-{4-[(4-chlorophenyl)methoxy]phenyl}-1-phenyl-1H-pyrazol-4-yl)methylidene]-4-oxo-2-sulfanylidene-1,3-thiazolidin-3-yl]ethane-1-sulfonic acid rhodanine derivative, 38
Type:
Small organic molecule
Emp. Form.:
C28H22ClN3O5S3
Mol. Mass.:
612.139
SMILES:
OS(=O)(=O)CCN1C(=S)S\C(=C/c2cn(nc2-c2ccc(OCc3ccc(Cl)cc3)cc2)-c2ccccc2)C1=O
: