Target
Botulinum neurotoxin type A
Ligand
BDBM91564
Substrate
EC50
2400±n/a nM
Citation
 PubChem, PC Confirmatory FRET assay using full length substrates for Botulinum neurotoxin light chain A protease, with Powder Set01 PubChem Bioassay (2013)[AID] 
Target
Name:
Botulinum neurotoxin type A
Synonyms:
BXA1_CLOBH bna | botA
Type:
PROTEIN
Mol. Mass.:
149421.96
Organism:
Clostridium botulinum (strain Hall / ATCC 3502 / NCTC 13319 / Type A)
Description:
ChEMBL_987932
Residue:
1296
  
Inhibitor
Name:
BDBM91564
Synonyms:
6-(4-chlorophenyl)-2,3-diphenyl-imidazo[1,2-b][1,2,4]triazine VU0467049-1 | cid_3297919
Type:
Small organic molecule
Emp. Form.:
C23H15ClN4
Mol. Mass.:
382.845
SMILES:
Clc1ccc(cc1)-c1cn2nc(-c3ccccc3)c(nc2n1)-c1ccccc1
: