Target
Huntingtin
Ligand
BDBM96413
Substrate
IC50
1010±n/a nM
Citation
 PubChem, PC Fluorescence-based biochemical high throughput dose response assay to identify molecules that bind r(CAG) RNA repeats PubChem Bioassay (2013)[AID] 
Target
Name:
Huntingtin
Synonyms:
HD HD_HUMAN Homo sapiens huntingtin (HTT), mRNA Huntington disease protein | IT15
Type:
PROTEIN
Mol. Mass.:
347579.69
Organism:
Homo sapiens (Human)
Description:
EBI_101216
Residue:
3142
  
Inhibitor
Name:
BDBM96413
Synonyms:
6-(2-furanyl)-3-methyl-1-phenyl-4-pyrazolo[3,4-b]pyridinecarboxylic acid 6-(furan-2-yl)-3-methyl-1-phenyl-pyrazolo[3,4-b]pyridine-4-carboxylic acid MLS000060726 US9394303, 2 | cid_2998778
Type:
Small organic molecule
Emp. Form.:
C18H13N3O3
Mol. Mass.:
319.3141
SMILES:
Cc1nn(-c2ccccc2)c2nc(cc(C(O)=O)c12)-c1ccco1
: