Target
Huntingtin
Ligand
BDBM96474
Substrate
IC50
1734±n/a nM
Citation
 PubChem, PC Fluorescence-based biochemical high throughput dose response assay to identify molecules that bind r(CAG) RNA repeats PubChem Bioassay (2013)[AID] 
Target
Name:
Huntingtin
Synonyms:
HD HD_HUMAN Homo sapiens huntingtin (HTT), mRNA Huntington disease protein | IT15
Type:
PROTEIN
Mol. Mass.:
347579.69
Organism:
Homo sapiens (Human)
Description:
EBI_101216
Residue:
3142
  
Inhibitor
Name:
BDBM96474
Synonyms:
MLS001180600 N-[4-[(5-ethyl-1,3,4-thiadiazol-2-yl)sulfamoyl]phenyl]-2,2-diphenyl-acetamide;propan-2-ol N-[4-[(5-ethyl-1,3,4-thiadiazol-2-yl)sulfamoyl]phenyl]-2,2-diphenylacetamide;2-propanol SMR000477139 | cid_23723092
Type:
Small organic molecule
Emp. Form.:
C24H22N4O3S2
Mol. Mass.:
478.586
SMILES:
CCc1nnc(NS(=O)(=O)c2ccc(NC(=O)C(c3ccccc3)c3ccccc3)cc2)s1
: