Target
Huntingtin
Ligand
BDBM96537
Substrate
IC50
1367±n/a nM
Citation
 PubChem, PC Fluorescence-based biochemical high throughput dose response assay to identify molecules that bind r(CAG) RNA repeats PubChem Bioassay (2013)[AID] 
Target
Name:
Huntingtin
Synonyms:
HD HD_HUMAN Homo sapiens huntingtin (HTT), mRNA Huntington disease protein | IT15
Type:
PROTEIN
Mol. Mass.:
347579.69
Organism:
Homo sapiens (Human)
Description:
EBI_101216
Residue:
3142
  
Inhibitor
Name:
BDBM96537
Synonyms:
1-[1-(4-chlorophenyl)cyclobutanecarbonyl]-2-methyl-N-(2-naphthylsulfonyl)azetidine-2-carboxamide 1-[1-(4-chlorophenyl)cyclobutyl]carbonyl-2-methyl-N-naphthalen-2-ylsulfonyl-azetidine-2-carboxamide MLS003118445 cid_49789501
Type:
Small organic molecule
Emp. Form.:
C26H25ClN2O4S
Mol. Mass.:
497.006
SMILES:
CC1(CCN1C(=O)C1(CCC1)c1ccc(Cl)cc1)C(=O)NS(=O)(=O)c1ccc2ccccc2c1
: