Target
Huntingtin
Ligand
BDBM96545
Substrate
IC50
1669±n/a nM
Citation
 PubChem, PC Fluorescence-based biochemical high throughput dose response assay to identify molecules that bind r(CAG) RNA repeats PubChem Bioassay (2013)[AID] 
Target
Name:
Huntingtin
Synonyms:
HD HD_HUMAN Homo sapiens huntingtin (HTT), mRNA Huntington disease protein | IT15
Type:
PROTEIN
Mol. Mass.:
347579.69
Organism:
Homo sapiens (Human)
Description:
EBI_101216
Residue:
3142
  
Inhibitor
Name:
BDBM96545
Synonyms:
2,4-dichloro-6-(3,5-dichloro-2-hydroxy-phenyl)sulfinyl-phenol 2-[3,5-bis(chloranyl)-2-oxidanyl-phenyl]sulfinyl-4,6-bis(chloranyl)phenol HL-9 SMR001550649 | cid_68939
Type:
Small organic molecule
Emp. Form.:
C12H6Cl4O3S
Mol. Mass.:
372.051
SMILES:
Oc1c(Cl)cc(Cl)cc1S(=O)c1cc(Cl)cc(Cl)c1O
: