Target
Acetyl-CoA carboxylase 2 [151-2458]
Ligand
BDBM97611
Substrate
Meas. Tech.
Luminometric Assay
pH
7.5±0
Temperature
310.15±0 K
IC50
7e+1±n/a nM
Citation
 Zoller, GSchmoll, DMueller, MHaschke, GFocken, I Heterocyclic compounds, processes for their preparation, medicaments comprising these compounds, and the use thereof US Patent  US8470841 Publication Date 6/25/2013 
Target
Name:
Acetyl-CoA carboxylase 2 [151-2458]
Synonyms:
ACACB ACC2 Acetyl-CoA carboxylase 2 (ACC2)
Type:
Protein
Mol. Mass.:
260677.17
Organism:
Homo sapiens (Human)
Description:
O00763 aa 1-150 removed
Residue:
2308
  
Inhibitor
Name:
BDBM97611
Synonyms:
CHEMBL1630712 | US8470841, 36
Type:
Small organic molecule
Emp. Form.:
C24H26N2O3
Mol. Mass.:
390.4748
SMILES:
CC(CCc1ccc(Oc2ccc(OCc3ccccc3)nc2)cc1)NC(C)=O
: