Target
Dual specificity mitogen-activated protein kinase kinase 1 [2-31,52-393,S218E,S222D]
Ligand
BDBM97645
Substrate
Meas. Tech.
Enzyme Assay
pH
7.3±0
Temperature
298.15±0 K
IC50
>16±0.0 nM
Citation
 Dong, QKaldor, SW MAPK/ERK kinase inhibitors US Patent  US8470837 Publication Date 6/25/2013 
Target
Name:
Dual specificity mitogen-activated protein kinase kinase 1 [2-31,52-393,S218E,S222D]
Synonyms:
Dual specificity mitogen-activated protein kinase kinase 1 MEK1 PRKMK1
Type:
Protein
Mol. Mass.:
40898.07
Organism:
Homo sapiens (Human)
Description:
Q02750[2-31,52-393,S218E,S222D]
Residue:
372
  
Inhibitor
Name:
BDBM97645
Synonyms:
US8470837, 15
Type:
Small organic molecule
Emp. Form.:
C17H17FN4O3
Mol. Mass.:
344.3403
SMILES:
Cc1c(Nc2ccccc2F)c2c(ncn(CCO)c2=O)n(C)c1=O
: