Target
Tyrosine-protein kinase BTK
Ligand
BDBM97670
Substrate
Meas. Tech.
In Vitro Inhibition Assay
pH
7.4±0
IC50
1.9±0.0 nM
Citation
 Honigberg, LVerner, EPan, Z Inhibitors of Bruton's tyrosine kinase US Patent  US8476284 Publication Date 7/2/2013 
Target
Name:
Tyrosine-protein kinase BTK
Synonyms:
AGMX1 Agammaglobulinaemia tyrosine kinase B cell progenitor kinase BPK BTK_HUMAN Tyrosine Kinase BTK Tyrosine-protein kinase BTK (BTK)
Type:
Enzyme
Mol. Mass.:
76289.95
Organism:
Homo sapiens (Human)
Description:
Q06187
Residue:
659
  
Inhibitor
Name:
BDBM97670
Synonyms:
US8476284, 38 | US9133201, 12
Type:
Small organic molecule
Emp. Form.:
C24H22N6O2
Mol. Mass.:
426.4705
SMILES:
Nc1ncnc2n(nc(-c3ccc(Oc4ccccc4)cc3)c12)[C@H]1CCN(C1)C(=O)C=C
: